虚拟机-OpenJDK make 编译出现错误

问题描述

OpenJDK make 编译出现错误

本人刚刚开始学习Java虚拟机看的是《深入理解Java虚拟机》一书,但刚刚一开始就遇到了困难,在编译OpenJDK时,make sanity通过编译,但是make all失败了,错误如下:

 build-bootstrap-javac:
    [javac] Compiling 111 source files to /Users/xiaoliufu/Develop/JVM/jdkBuild/openjdk-7u40/build-fastdebug/langtools/build/bootstrap/classes
    [javac] /Users/xiaoliufu/Develop/JVM/jdkBuild/openjdk-7u40/langtools/src/share/classes/com/sun/tools/javac/comp/Resolve.java:2183: ??: [overrides] ?Resolve.InapplicableSymbolsError.Candidate?????, ???????????? hashCode ??
    [javac]         private class Candidate {
    [javac]                 ^
    [javac] error: warnings found and -Werror
    [javac] 1 error
    [javac] 1 warning

BUILD FAILED
/Users/xiaoliufu/Develop/JVM/jdkBuild/openjdk-7u40/langtools/make/build.xml:452: The following error occurred while executing this line:
/Users/xiaoliufu/Develop/JVM/jdkBuild/openjdk-7u40/langtools/make/build.xml:795: Compile failed; see the compiler error output for details.

在ubuntu上和在Mac OSX上均进行了测试,都是这样的提示,希望有大神能指教一下,不胜感激!

解决方案

看看是不是内存不够。

解决方案二:

看看是不是内存不够。

解决方案三:

自己先顶一下!

解决方案四:

make 出现的错误
xubuntu编译OpencV2.4.2出现make交叉编译出现错误。
Android 源码编译,make时出现错误,求助!!!!!!!!

时间: 2024-09-30 02:20:06

虚拟机-OpenJDK make 编译出现错误的相关文章

在ubuntu上编译jdk错误

问题描述 在ubuntu上编译jdk错误 我在ubuntu14.04上编译jdk(openjdk-7u6-fcs-src-b24-28_aug_2012.zip)错误:make[5]: *** [jvmg] Error 127 make[5]: Leaving directory /home/yuege/openjdk/build-debug/hotspot/outputdir' make[4]: *** [generic_build2] Error 2 make[4]: Leaving dir

wp8-开发WP8.1应用时,引用using Newtonsoft.Json.Linq;,编译出现错误。

问题描述 开发WP8.1应用时,引用using Newtonsoft.Json.Linq;,编译出现错误. 在 System.dll模块中找不到类型System.ComponentModel.PropertyDescriptor. 解决方案 windows phone的.net不支持System.ComponentModel.PropertyDescriptor换别的库解析json 解决方案二: 试试 JavaScriptSerializer:在System.Web.Extensions.dll

ihtmlinputelement-加了mshtml.h头文件,编译有错误:IHTMLInputElement 没有定义

问题描述 加了mshtml.h头文件,编译有错误:IHTMLInputElement 没有定义 我做了一个有关网页的工程,在所在类加了#include "mshtml.h",其中.cpp代码中有:IHTMLInputElement *input;----程序编译的时候则有error C2065: 'IHTMLInputElement' : undeclared identifier : error C2065: 'input' : undeclared identifier 请高人指点

path-ubuntu编译./configure错误

问题描述 ubuntu编译./configure错误 configure: error: Library requirements (libgnome-2.0 >= 2.0.0 libgnomeui-2.0 >= 2.0.0 gtk+-2.0 >= 2.4.0 gnome-vfs-2.0 >= 2.6.0 libglade-2.0 >= 2.3.6) not met; consider adjusting the PKG_CONFIG_PATH environment var

using-C++编译没错误,运行停止工作,菜鸟求指点

问题描述 C++编译没错误,运行停止工作,菜鸟求指点 #include #include using namespace std; int main() { string ch = ""; char*p=&ch[0]; cout <<"input cipher code:"; gets(p); cout <<"cipher code:"<<ch<<endl; int j=0; for(j=0

c语言 链表 输入问题,编译没错误, 运行 错误

问题描述 c语言 链表 输入问题,编译没错误, 运行 错误 #include #define M 20 int f(char a[]) { int i ; i=0; while (a[i]='n') i++; i--; while (i>0&& a[i]==' '||a[i]=='t') i--; if(i>0) { i++; a[i]='n'; i++; a[i]=''; } return 1; } int getline (char s[],int lim ) { int

关于java问题-编译中错误说第一行需要标示符是什么意思

问题描述 编译中错误说第一行需要标示符是什么意思 package dataStructure.Linear.*; import dataStructure.LinearList.Node; //导入指定包中的类或接口 import dataStructure.LinearList.SeqStack; //导入指定包中的类或接口 import dataStructure.LinearList.LinkedStack; //导入指定包中的类或接口 public class Expression {

求解答-编译没有错误,随便输入10个数之后,为什么“输入元素数是:”后面的就不执行了呢

问题描述 编译没有错误,随便输入10个数之后,为什么"输入元素数是:"后面的就不执行了呢 { Console.WriteLine("请输入数组中的10个元素数:"); int[] a=new int[10]; for (int i = 0; i < a.Length; i++) { a[i] = int.Parse(Console.ReadLine()); } Console.WriteLine("输入的元素数是:"); for (int

android源码编译出错误

问题描述 android源码编译出错误 请教下,我按正常的源码编译流程报了一个错误,collect2: ld returned 1 exit status make: *** [out/target/product/generic/obj/SHARED_LIBRARIES/libstagefright_omx_intermediates/LINKED/libstagefright_omx.so] Error 1 网上找的解决办法是:cp -Rfp device/ti/blaze/buildspe